1-(1-Ethenyl)-trans-2-(trans-2-butenyl)-cyclopropane

Kovats' RI, non-polar column, isothermal

View large format table.

Column type Active phase Temperature (C) I Reference Comment
CapillarySqualane100.867.2Schomburg and Dielmann, 1973Column length: 100. m; Column diameter: 0.25 mm
CapillarySqualane80.866.2Schomburg and Dielmann, 1973Column length: 100. m; Column diameter: 0.25 mm

References

Schomburg and Dielmann, 1973
Schomburg, G.; Dielmann, G., Use of retention increments for identification and correlation of saturated and unsaturated cyclopropane hydrocarbons by means of Kovats indices, Anal. Chem., 1973, 45, 9, 1647-1658, https://doi.org/10.1021/ac60331a021 . [all data]