4-Cyclopentyl-cyclohexene

Kovats' RI, non-polar column, isothermal

Data compiled by: NIST Mass Spectrometry Data Center, William E. Wallace, director

Column type CapillaryCapillary
Active phase SqualaneApiezon L
Column length (m) 50.50.
Carrier gas
Substrate
Column diameter (mm) 0.250.25
Phase thickness (μm)
Temperature (C) 100.100.
I 1192.1227.
ReferenceBesson and Gäumann, 1973Besson and Gäumann, 1973
Comment MSDC-RI MSDC-RI

References

Besson and Gäumann, 1973
Besson, R.; Gäumann, T., Indices de rétention de cycloalcanes, cycloalcènes, bicycloalkyles, cycloalkyl-cycloalcényles et bicycloalcényles en chromatographie en phase gazeuse, Helv. Chim. Acta, 1973, 56, 3, 1159-1164, https://doi.org/10.1002/hlca.19730560339 . [all data]