2-isobutyladamantane

Kovats' RI, non-polar column, isothermal

View large format table.

Column type Active phase Temperature (C) I Reference Comment
CapillarySE-30190.1453.Sarkisova and Pimerzin, 2005He; Column length: 50. m; Column diameter: 0.2 mm
PackedApiezon L170.1473.Kurbatova, Moiseev, et al., 1998Chromaton N-AW; Column length: 1. m
CapillarySE-30130.1408.Bogoslovsky, Anvaer, et al., 1978
CapillarySE-30140.1415.Bogoslovsky, Anvaer, et al., 1978
CapillarySE-30145.1416.Bogoslovsky, Anvaer, et al., 1978
CapillarySE-30150.1423.Bogoslovsky, Anvaer, et al., 1978
PackedSE-30120.1415.Mitra, Mohan, et al., 1974N2, Chrom W; Column length: 6.1 m
PackedSE-30130.1423.Mitra, Mohan, et al., 1974N2, Chrom W; Column length: 6.1 m
PackedSE-30140.1432.Mitra, Mohan, et al., 1974N2, Chrom W; Column length: 6.1 m
CapillarySE-30145.1416.Burkhard, Vais, et al., 1969N2; Column length: 50. m; Column diameter: 0.27 mm
CapillarySE-30160.1429.Burkhard, Vais, et al., 1969N2; Column length: 50. m; Column diameter: 0.27 mm
CapillarySE-30175.1440.Burkhard, Vais, et al., 1969N2; Column length: 50. m; Column diameter: 0.27 mm
CapillarySE-30190.1453.Burkhard, Vais, et al., 1969N2; Column length: 50. m; Column diameter: 0.27 mm

Kovats' RI, polar column, isothermal

View large format table.

Column type Active phase Temperature (C) I Reference Comment
CapillaryCarbowax 20M145.1581.Burkhard, Vais, et al., 1969N2; Column length: 50. m; Column diameter: 0.27 mm
CapillaryCarbowax 20M160.1604.Burkhard, Vais, et al., 1969N2; Column length: 50. m; Column diameter: 0.27 mm
CapillaryCarbowax 20M175.1623.Burkhard, Vais, et al., 1969N2; Column length: 50. m; Column diameter: 0.27 mm

References

Sarkisova and Pimerzin, 2005
Sarkisova, V.S.; Pimerzin, A.A., Gas chromatographic characteristics and boiling points of diadamantanes, Pet. Chem. USSR (Engl. Transl.), 2005, 45, 1, 63-66. [all data]

Kurbatova, Moiseev, et al., 1998
Kurbatova, S.V.; Moiseev, I.K.; Zemtsova, M.N., Retention of alkyladamantanes in gas chromatography, J. Anal. Chem. USSR (Engl. Transl.), 1998, 53, 3, 273-276. [all data]

Bogoslovsky, Anvaer, et al., 1978
Bogoslovsky, Yu.N.; Anvaer, B.I.; Vigdergauz, M.S., Chromatographic constants in gas chromatography (in Russian), Standards Publ. House, Moscow, 1978, 192. [all data]

Mitra, Mohan, et al., 1974
Mitra, G.D.; Mohan, G.; Sinha, A., Advances in the utilization of the retention index system for characterizing hydrocarbons in complex mixtures by gas chromatography, J. Chromatogr., 1974, 99, 215-230, https://doi.org/10.1016/S0021-9673(00)90857-4 . [all data]

Burkhard, Vais, et al., 1969
Burkhard, J.; Vais, J.; Vodicka, L.; Landa, S., Adamantane and its derivatives. XVI. The gas chromatographic characterization of adamantane derivatives, J. Chromatogr., 1969, 42, 207-218, https://doi.org/10.1016/S0021-9673(01)80617-8 . [all data]