Copaane

Kovats' RI, non-polar column, isothermal

View large format table.

Column type Active phase Temperature (C) I Reference Comment
PackedSF-96170.1455.Andersen and Falcone, 1969
PackedSF-96170.1421.Andersen and Falcone, 1969
PackedApiezon L155.1477.Andersen and Falcone, 1969
PackedApiezon L155.1437.Andersen and Falcone, 1969

Kovats' RI, polar column, isothermal

View large format table.

Column type Active phase Temperature (C) I Reference Comment
PackedCarbowax 20M165.1599.Andersen and Falcone, 1969
PackedCarbowax 20M165.1550.Andersen and Falcone, 1969

References

Andersen and Falcone, 1969
Andersen, N.H.; Falcone, M.S., The identification of sesquiterpene hydrocarbons from gas-liquid chromatography retention data, J. Chromatogr., 1969, 44, 52-59, https://doi.org/10.1016/S0021-9673(01)92497-5 . [all data]