γ-isogeranyl acetate

Kovats' RI, non-polar column, isothermal

Data compiled by: NIST Mass Spectrometry Data Center, William E. Wallace, director

Column type Packed
Active phase Apiezon L
Column length (m) 2.5
Carrier gas N2
Substrate Embacel
Column diameter (mm)
Phase thickness (μm)
Temperature (C) 150.
I 1276.
Referenceter Heide, 1968
Comment MSDC-RI

Kovats' RI, polar column, isothermal

Data compiled by: NIST Mass Spectrometry Data Center, William E. Wallace, director

Column type Packed
Active phase Carbowax 20M
Column length (m) 2.5
Carrier gas N2
Substrate Embacel
Column diameter (mm)
Phase thickness (μm)
Temperature (C) 150.
I 1726.
Referenceter Heide, 1968
Comment MSDC-RI

References

ter Heide, 1968
ter Heide, R., Studies on terpenes. II. Characterization of monoterpene esters by gas and thin-layer chromatography, Z. Anal. Chem., 1968, 236, 215-227. [all data]