exo-Bicyclo[2.2.1]heptan-2-carboxylic acid, 7,7-cyclopropano-, methyl ester

Kovats' RI, non-polar column, isothermal

View large format table.

Column type Active phase Temperature (C) I Reference Comment
PackedSE-30140.1262.Heintz, Gruselle, et al., 1976Chromosorb W (60-80 mesh); Column length: 2. m

Kovats' RI, polar column, isothermal

View large format table.

Column type Active phase Temperature (C) I Reference Comment
PackedCarbowax 20M140.1639.Heintz, Gruselle, et al., 1976Chromosorb W (60-80 mesh); Column length: 2. m

References

Heintz, Gruselle, et al., 1976
Heintz, M.; Gruselle, M.; Druilhe, A.; Lefort, D., Relations entre structure chimique et données de rétention en chromatographie en phase gaseuse. VI. Alcools et esters méthyliques de structures cycliques, Chromatographia, 1976, 9, 8, 367-372, https://doi.org/10.1007/BF02330385 . [all data]