Octanedioic acid, diheptyl ester

Kovats' RI, non-polar column, isothermal

Data compiled by: NIST Mass Spectrometry Data Center, William E. Wallace, director

Column type Packed
Active phase SE-30
Column length (m) 2.
Carrier gas
Substrate
Column diameter (mm)
Phase thickness (μm)
Temperature (C) 220.
I 2513.
ReferenceZulaïca and Guiochon, 1963
Comment MSDC-RI

References

Zulaïca and Guiochon, 1963
Zulaïca, J.; Guiochon, G., Séparation et identification de di-esters aliphatiques et aromatiques et de trimesters phosphoriques par chromatographie en phase gazeuse, Bull. Soc. Chim. Fr., 1963, 6, 1242-1252. [all data]