Butanedioic acid, dinonyl ester

Kovats' RI, non-polar column, isothermal

View large format table.

Column type Active phase Temperature (C) I Reference Comment
PackedSE-30220.2497.Zulaïca and Guiochon, 1963Column length: 2. m

References

Zulaïca and Guiochon, 1963
Zulaïca, J.; Guiochon, G., Séparation et identification de di-esters aliphatiques et aromatiques et de trimesters phosphoriques par chromatographie en phase gazeuse, Bull. Soc. Chim. Fr., 1963, 6, 1242-1252. [all data]