(Z)-α-Santalol

Normal alkane RI, non-polar column, temperature ramp

Data compiled by: NIST Mass Spectrometry Data Center, William E. Wallace, director

Column type CapillaryCapillaryCapillaryCapillaryCapillary
Active phase RTX-5 MSDB-5MSDB-5DB-5DB-5
Column length (m) 30.30.30.30.30.
Carrier gas HeliumHe HeHe
Substrate
Column diameter (mm) 0.250.250.250.250.25
Phase thickness (μm) 0.500.250.250.250.25
Tstart (C) 35.60.50.60.60.
Tend (C) 225.280.265.220.240.
Heat rate (K/min) 6.3.2.53.3.
Initial hold (min) 5. 0.54.
Final hold (min) 10.30.
I 1674.1647.1652.1678.1679.
ReferenceWatcharananun, Cadwallader, et al., 2009Maronigiu, Piras, et al., 2006Nickavar B., Kamalinejad M., et al., 2006Salehi, Sefidkon, et al., 2005Kobaisy, Tellez, et al., 2002
Comment MSDC-RI MSDC-RI MSDC-RI MSDC-RI MSDC-RI

Van Den Dool and Kratz RI, non-polar column, temperature ramp

Data compiled by: NIST Mass Spectrometry Data Center, William E. Wallace, director

Column type CapillaryCapillaryCapillaryCapillary
Active phase DB-5HP-5MSDB-5HP-5MS
Column length (m) 30.30.30.30.
Carrier gas HeHeHeHe
Substrate
Column diameter (mm) 0.250.250.250.25
Phase thickness (μm) 0.250.25 0.25
Tstart (C) 60.50.50.60.
Tend (C) 240.250.250.280.
Heat rate (K/min) 3.5.3.4.
Initial hold (min)  2. 5.
Final hold (min)  5.
I 1680.1658.1680.1678.
ReferenceTampieri, Galuppi, et al., 2003Shang, Hu, et al., 2002Isidorov, Zenkevich, et al., 2001Skaltsa, Mavrommati, et al., 2001
Comment MSDC-RI MSDC-RI MSDC-RI MSDC-RI

References

Watcharananun, Cadwallader, et al., 2009
Watcharananun, W.; Cadwallader, K.R.; Huangrak, K.; Kim, H.; Lorjaroenphon, Y., Identification of predominant odorants in Thai desserts flavored by smoking with Tian Op, a traditional Thai scented candle, J. Agric. Food Chem., 2009, 57, 3, 996-1005, https://doi.org/10.1021/jf802674c . [all data]

Maronigiu, Piras, et al., 2006
Maronigiu, B.; Piras, A.; Porcedda, S.; Tuveri, E., Extraction of Santalum album and Boswellia carterii Birdw. volatile oil by supercritical carbon dioxide: influence of some process parameters, Flavour Fragr. J., 2006, 21, 4, 718-724, https://doi.org/10.1002/ffj.1718 . [all data]

Nickavar B., Kamalinejad M., et al., 2006
Nickavar B.; Kamalinejad M.; Mohandesi S., Comparison of the components of the essential oils from leaves and fruits of Grammosciadium platycarpum, Chem. Nat. Compd. (Engl. Transl.), 2006, 42, 6, 686-688, https://doi.org/10.1007/s10600-006-0252-x . [all data]

Salehi, Sefidkon, et al., 2005
Salehi, P.; Sefidkon, F.; Bazzaz Tolami, L.; Sonboli, A., Essential oil composition of Salvia palaestina Benth. from Iran, Flavour Fragr. J., 2005, 20, 5, 525-527, https://doi.org/10.1002/ffj.1448 . [all data]

Kobaisy, Tellez, et al., 2002
Kobaisy, M.; Tellez, M.R.; Dayan, F.E.; Duke, S.O., Phytotoxicity and volatile constituents from leaves of Callicarpa japonica Thunb., Phytochemistry, 2002, 61, 1, 37-40, https://doi.org/10.1016/S0031-9422(02)00207-8 . [all data]