β-Santalol acetate (Z)

Van Den Dool and Kratz RI, non-polar column, temperature ramp

View large format table.

Column type Active phase I Reference Comment
CapillarySE-541823.Simionatto, Porto, et al., 200525. m/0.25 mm/0.2 μm, H2, 4. K/min; Tstart: 50. C; Tend: 250. C

Van Den Dool and Kratz RI, polar column, temperature ramp

View large format table.

Column type Active phase I Reference Comment
CapillaryPEG-20M2378.Simionatto, Porto, et al., 20054. K/min; Tstart: 50. C; Tend: 250. C

Normal alkane RI, non-polar column, temperature ramp

View large format table.

Column type Active phase I Reference Comment
CapillaryDB-5MS1794.Maronigiu, Piras, et al., 200630. m/0.25 mm/0.25 μm, He, 3. K/min, 280. C @ 30. min; Tstart: 60. C

Normal alkane RI, non-polar column, custom temperature program

View large format table.

Column type Active phase I Reference Comment
CapillarySE-301813.Vinogradov, 2004Program: not specified
CapillaryMethyl Silicone1813.Zenkevich, 1999Program: not specified

References

Simionatto, Porto, et al., 2005
Simionatto, E.; Porto, C.; da Silva, U.F.; Squizani, A.; Dalcol, I.I.; Morel, A.F., Composition and antimicrobial activity of the essential oil from Aloysia sellowii, J. Braz. Chem. Soc., 2005, 16, 6B, 1458-1462, https://doi.org/10.1590/S0103-50532005000800028 . [all data]

Maronigiu, Piras, et al., 2006
Maronigiu, B.; Piras, A.; Porcedda, S.; Tuveri, E., Extraction of Santalum album and Boswellia carterii Birdw. volatile oil by supercritical carbon dioxide: influence of some process parameters, Flavour Fragr. J., 2006, 21, 4, 718-724, https://doi.org/10.1002/ffj.1718 . [all data]

Vinogradov, 2004
Vinogradov, B.A., Production, composition, properties and application of essential oils, 2004, retrieved from http://viness.narod.ru. [all data]

Zenkevich, 1999
Zenkevich, I.G., Analytical Parameters of Components of essential Oils for their Gas Chromatographic and Chromato-Mass-Spectral Identification. Acetates of Terpene Alcohols, Rastitelnye Resursy (Plant Resources), 1999, 35, 1, 30-37. [all data]