trans-piperitol acetate

Van Den Dool and Kratz RI, non-polar column, temperature ramp

Data compiled by: NIST Mass Spectrometry Data Center, William E. Wallace, director

Column type CapillaryCapillary
Active phase DB-5RTX-5
Column length (m) 30.30.
Carrier gas N2He
Substrate
Column diameter (mm) 0.320.25
Phase thickness (μm) 0.250.25
Tstart (C) 60.45.
Tend (C) 240.300.
Heat rate (K/min) 3.3.
Initial hold (min) 3.6.
Final hold (min) 5.10.
I 1330.1342.
ReferenceDob, Dahmane, et al., 2006Dugo, Mondello, et al., 2004
Comment MSDC-RI MSDC-RI

Normal alkane RI, polar column, temperature ramp

Data compiled by: NIST Mass Spectrometry Data Center, William E. Wallace, director

Column type Capillary
Active phase HP-Innowax
Column length (m) 30.
Carrier gas N2
Substrate
Column diameter (mm) 0.25
Phase thickness (μm) 0.25
Tstart (C) 50.
Tend (C) 240.
Heat rate (K/min) 5.
Initial hold (min) 1.
Final hold (min) 4.
I 1678.
ReferenceCheraif, Ben Jannet, et al., 2007
Comment MSDC-RI

Kovats' RI, non-polar column, temperature ramp

Data compiled by: NIST Mass Spectrometry Data Center, William E. Wallace, director

Column type CapillaryCapillary
Active phase DB-5DB-5
Column length (m) 30.30.
Carrier gas HeHe
Substrate
Column diameter (mm) 0.260.26
Phase thickness (μm) 0.250.25
Tstart (C) 60.60.
Tend (C) 246.246.
Heat rate (K/min) 3.3.
Initial hold (min)
Final hold (min)
I 1346.1346.
ReferenceAdams, Morris, et al., 2005Adams and Nguyen, 2005
Comment MSDC-RI MSDC-RI

References

Dob, Dahmane, et al., 2006
Dob, T.; Dahmane, D.; Chelghoum, C., Essential oil composition of Juniperus oxycedrus growing in Algeria, Pharm. Biol., 2006, 44, 1, 1-6, https://doi.org/10.1080/13880200500530922 . [all data]

Dugo, Mondello, et al., 2004
Dugo, P.; Mondello, L.; Zappia, G.; Bonaccorsi, I.; Cotroneo, A.; Russo, M.T., The composition of the volatile fraction and the enantiomeric distribution of five volatile components of faustrime oil (Monocitrus australatica x Fortunella sp. x Citrus aurantifolia), J. Essent. Oil Res., 2004, 16, 4, 328-333, https://doi.org/10.1080/10412905.2004.9698734 . [all data]