p-menth-1-en-9-yl acetate

Normal alkane RI, polar column, temperature ramp

Data compiled by: NIST Mass Spectrometry Data Center, William E. Wallace, director

Column type Capillary
Active phase DB-Wax
Column length (m) 60.
Carrier gas N2
Substrate
Column diameter (mm) 0.25
Phase thickness (μm) 0.25
Tstart (C) 70.
Tend (C) 230.
Heat rate (K/min) 2.
Initial hold (min) 2.
Final hold (min) 20.
I 1824.
ReferenceChoi, 2006
Comment MSDC-RI

References

Choi, 2006
Choi, H.-S., Headspace analyses of fresh leaves and stems of Angelica gigas Nakai, a Korean medicinal herb, Flavour Fragr. J., 2006, 21, 4, 604-608, https://doi.org/10.1002/ffj.1602 . [all data]