Neopulegyl acetate

Normal alkane RI, non-polar column, custom temperature program

Data compiled by: NIST Mass Spectrometry Data Center, William E. Wallace, director

Column type Capillary
Active phase Methyl Silicone
Column length (m)
Carrier gas
Substrate
Column diameter (mm)
Phase thickness (μm)
Program not specified
I 1263.
ReferenceZenkevich, 1999
Comment MSDC-RI

References

Zenkevich, 1999
Zenkevich, I.G., Analytical Parameters of Components of essential Oils for their Gas Chromatographic and Chromato-Mass-Spectral Identification. Acetates of Terpene Alcohols, Rastitelnye Resursy (Plant Resources), 1999, 35, 1, 30-37. [all data]