cis-Verbenyl acetate

Kovats' RI, non-polar column, temperature ramp

View large format table.

Column type Active phase I Reference Comment
CapillaryHP-5MS1280.Juliani, Zygadlo, et al., 200430. m/0.25 mm/0.25 μm, He, 60. C @ 1. min, 4. K/min, 200. C @ 15. min

Kovats' RI, non-polar column, custom temperature program

View large format table.

Column type Active phase I Reference Comment
CapillaryDB-51257.Roscigno, 199830. m/0.25 mm/0.25 μm; Program: 50C(5min) => 2C/min => 250C (60min) => 2C/min => 270C => 1C/min => 290C

Van Den Dool and Kratz RI, non-polar column, temperature ramp

View large format table.

Column type Active phase I Reference Comment
CapillaryCP-Sil PONA GB1264.Cunicao, Lopes, et al., 2007100. m/0.25 mm/0.25 μm, He, 140. C @ 10. min, 5. K/min, 230. C @ 25. min
CapillarySPB-51282.Pino, Marbot, et al., 200330. m/0.25 mm/0.25 μm, He, 60. C @ 2. min, 4. K/min, 250. C @ 20. min
CapillaryRTX-51279.Shellie, Marriott, et al., 200330. m/0.25 mm/0.25 μm, He, 45. C @ 6. min, 3. K/min; Tend: 250. C

Normal alkane RI, non-polar column, temperature ramp

View large format table.

Column type Active phase I Reference Comment
CapillaryHP-5MS1282.Farah, Afifi, et al., 200630. m/0.25 mm/0.25 μm, He, 2. K/min; Tstart: 50. C; Tend: 250. C
CapillaryDB-51278.Khayyat and Karimi, 2005He, 3. K/min; Column length: 30. m; Column diameter: 0.32 mm; Tstart: 60. C; Tend: 240. C
CapillaryDB-51279.Khayyat and Karimi, 2005He, 3. K/min; Column length: 30. m; Column diameter: 0.32 mm; Tstart: 60. C; Tend: 240. C

Normal alkane RI, non-polar column, custom temperature program

View large format table.

Column type Active phase I Reference Comment
CapillaryDB-11264.Figueiredo, Sim-Sim, et al., 200530. m/0.25 mm/0.25 μm, He; Program: 45C => 3C/min => 175C => 15C/min => 300C (10min)
CapillarySE-301272.Vinogradov, 2004Program: not specified
CapillaryMethyl Silicone1272.Zenkevich, 1999Program: not specified

References

Juliani, Zygadlo, et al., 2004
Juliani, H.R.; Zygadlo, J.A.; Scrivanti, R.; de la Sota, E.; Simon, J.E., The essential oil of Anemia tomentosa (Savigny) Sw. var. anthriscifolia (Schrad.) Mickel, Flavour Fragr. J., 2004, 19, 6, 541-543, https://doi.org/10.1002/ffj.1341 . [all data]

Roscigno, 1998
Roscigno, G., Estrazione supercritica di principi farmaceutici e biopesticidi, Tesi di Laurea, Universita degli Studi di Salerno, Salerno, Italy, 1998, 121. [all data]

Cunicao, Lopes, et al., 2007
Cunicao, M.M.; Lopes, A.R.; Côcco, L.C.; Yamamoto, C.I.; Plocharski, R.C.B.; Miguel, M.D.; Junior, A.G.; Auer, C.G.; Miguel, O.G., Phytochemical and antibacterial evaluation of essential oils from Ottonia Martiana Miq. (Piperaceae), J. Braz. Chem. Soc., 2007, 18, 1, 184-188, https://doi.org/10.1590/S0103-50532007000100021 . [all data]

Pino, Marbot, et al., 2003
Pino, J.; Marbot, R.; Rosado, A.; Vázquez, C., Volatile constituents of fruits of Garcinia dulcis Kurz. from Cuba, Flavour Fragr. J., 2003, 18, 4, 271-274, https://doi.org/10.1002/ffj.1187 . [all data]

Shellie, Marriott, et al., 2003
Shellie, R.; Marriott, P.; Zappia, G.; Mondello, L.; Dugo, G., Interactive use of linear retention indices on polar and apolar columns with an MS-Library for reliable characterization of Australian tea tree and other Melaleuca sp. oils, J. Essent. Oil Res., 2003, 15, 5, 305-312, https://doi.org/10.1080/10412905.2003.9698597 . [all data]

Farah, Afifi, et al., 2006
Farah, A.; Afifi, A.; Fechtal, M.; Chhen, A.; Satrani, B.; Talbi, M.; Chaouch, A., Fractional distillation effect on the chemical composition of Moroccan myrtle (Myrtus communis L.) essential oils, Flavour Fragr. J., 2006, 21, 2, 351-354, https://doi.org/10.1002/ffj.1651 . [all data]

Khayyat and Karimi, 2005
Khayyat, M.H.; Karimi, H., Composition of the volatile oils of three different species of Artemisia, Iranian Journal of Pharmaceutical Sciences, 2005, 1, 1, 29-32. [all data]

Figueiredo, Sim-Sim, et al., 2005
Figueiredo, A.C.; Sim-Sim, M.; Costa, M.M.; Barroso, J.G.; Pedro, L.G.; Esquível, M.G.; Gutierres, F.; Lobo, C.; Fontinha, S., Comparison of the essential oil composition of four Plagiochila species: P. bifaria, P. maderensis, P. retrorsa and P. stricta, Flavour Fragr. J., 2005, 20, 6, 703-709, https://doi.org/10.1002/ffj.1627 . [all data]

Vinogradov, 2004
Vinogradov, B.A., Production, composition, properties and application of essential oils, 2004, retrieved from http://viness.narod.ru. [all data]

Zenkevich, 1999
Zenkevich, I.G., Analytical Parameters of Components of essential Oils for their Gas Chromatographic and Chromato-Mass-Spectral Identification. Acetates of Terpene Alcohols, Rastitelnye Resursy (Plant Resources), 1999, 35, 1, 30-37. [all data]