Thujyl acetate

Normal alkane RI, non-polar column, temperature ramp

Data compiled by: NIST Mass Spectrometry Data Center, William E. Wallace, director

Column type CapillaryCapillary
Active phase DB-5HP-5MS
Column length (m) 30.30.
Carrier gas Hydrogen
Substrate
Column diameter (mm) 0.250.25
Phase thickness (μm) 0.250.25
Tstart (C) 50.50.
Tend (C) 250.250.
Heat rate (K/min) 4.3.
Initial hold (min)  10.
Final hold (min)  5.
I 1290.1298.
ReferencePontes, de Olivera, et al., 2007Melkani, Dev, et al., 2005
Comment MSDC-RI MSDC-RI

Normal alkane RI, polar column, temperature ramp

Data compiled by: NIST Mass Spectrometry Data Center, William E. Wallace, director

Column type Capillary
Active phase DB-Wax
Column length (m) 60.
Carrier gas He
Substrate
Column diameter (mm) 0.25
Phase thickness (μm) 0.25
Tstart (C) 40.
Tend (C) 200.
Heat rate (K/min) 2.
Initial hold (min) 2.
Final hold (min)
I 1542.
ReferenceUmano, Hagi, et al., 2000
Comment MSDC-RI

Kovats' RI, polar column, isothermal

Data compiled by: NIST Mass Spectrometry Data Center, William E. Wallace, director

Column type Packed
Active phase Carbowax 20M
Column length (m) 2.5
Carrier gas N2
Substrate Embacel
Column diameter (mm)
Phase thickness (μm)
Temperature (C) 150.
I 1626.
Referenceter Heide, 1968
Comment MSDC-RI

References

Pontes, de Olivera, et al., 2007
Pontes, W.J.T.; de Olivera, J.C.G.; da Camara, C.A.G.; Lopes, A.C.H.R.; Gondim Jr.; de Olivera, J.V.; Barros, R.; Schwartz, M.O.E., Chemical composition and acaridical activity of the leaf and fruit essential oils of Protium heptaphyllum (Aubl.) Marchand (Burseraceae), Acta Amazonica, 2007, 37, 1, 103-110, https://doi.org/10.1590/S0044-59672007000100012 . [all data]

Melkani, Dev, et al., 2005
Melkani, A.B.; Dev, V.; Beauchamp, P.S.; Negi, A.; Mehta, S.P.S.; Melkani, K.B., Constituents of the essential oil of a new chemotype of Elsholtzia strobilifera Benth., Biochem. Syst. Ecol., 2005, 33, 4, 419-425, https://doi.org/10.1016/j.bse.2004.10.009 . [all data]