1-Terpineol, acetate

Normal alkane RI, non-polar column, custom temperature program

View large format table.

Column type Active phase I Reference Comment
CapillarySE-301294.Vinogradov, 2004Program: not specified
CapillaryMethyl Silicone1294.Zenkevich, 1999Program: not specified

References

Vinogradov, 2004
Vinogradov, B.A., Production, composition, properties and application of essential oils, 2004, retrieved from http://viness.narod.ru. [all data]

Zenkevich, 1999
Zenkevich, I.G., Analytical Parameters of Components of essential Oils for their Gas Chromatographic and Chromato-Mass-Spectral Identification. Acetates of Terpene Alcohols, Rastitelnye Resursy (Plant Resources), 1999, 35, 1, 30-37. [all data]