α-Eudesmol acetate

Normal alkane RI, non-polar column, custom temperature program

Data compiled by: NIST Mass Spectrometry Data Center, William E. Wallace, director

Column type CapillaryCapillaryCapillary
Active phase OV-1SE-30Methyl Silicone
Column length (m) 15.
Carrier gas He
Substrate
Column diameter (mm) 0.317
Phase thickness (μm)
Program 50C(4min) => 4C/min => 90C => 10C/min => 300C(10min)not specifiednot specified
I 1748.1779.1779.
ReferenceEl-Shazly and Hussein, 2004Vinogradov, 2004Zenkevich, 1999
Comment MSDC-RI MSDC-RI MSDC-RI

References

El-Shazly and Hussein, 2004
El-Shazly, A.M.; Hussein, K.T., Chemical analysis and biological activities of the essential oil of Teucrium leucocladum Boiss. (Lamiaceae), Biochem. Syst. Ecol., 2004, 32, 7, 665-674, https://doi.org/10.1016/j.bse.2003.12.009 . [all data]

Vinogradov, 2004
Vinogradov, B.A., Production, composition, properties and application of essential oils, 2004, retrieved from http://viness.narod.ru. [all data]

Zenkevich, 1999
Zenkevich, I.G., Analytical Parameters of Components of essential Oils for their Gas Chromatographic and Chromato-Mass-Spectral Identification. Acetates of Terpene Alcohols, Rastitelnye Resursy (Plant Resources), 1999, 35, 1, 30-37. [all data]