Naphthalene, 1,2,7-trichloro

Normal alkane RI, non-polar column, temperature ramp

Data compiled by: NIST Mass Spectrometry Data Center, William E. Wallace, director

Column type CapillaryCapillary
Active phase DB-5DB-5
Column length (m) 30.30.
Carrier gas HeliumHe
Substrate
Column diameter (mm) 0.250.25
Phase thickness (μm) 0.250.25
Tstart (C) 160.160.
Tend (C) 280.280.
Heat rate (K/min) 4.4.
Initial hold (min)
Final hold (min)
I 1812.1812.
ReferenceYin, Liu, et al., 2003Olivero and Kannan, 1999
Comment MSDC-RI MSDC-RI

References

Yin, Liu, et al., 2003
Yin, C.; Liu, S.; Wang, X.; Chen, D.; Wang, L., An efficient and simple approach to predict Kovat's indexes of poluychlorinated naphthalenes in gas chromatography, J. Chinese Chem. Soc., 2003, 50, 875-879. [all data]

Olivero and Kannan, 1999
Olivero, L.; Kannan, K., Quantitative structure - retention relationships of polychlorinated naphthalenes in gas chromatography, J. Chromatogr., 1999, 849, 2, 621-627, https://doi.org/10.1016/S0021-9673(99)00402-1 . [all data]