Naphthalene, 1,2,3,4,5,6,7-heptachloro

Normal alkane RI, non-polar column, temperature ramp

View large format table.

Column type Active phase I Reference Comment
CapillaryDB-52694.Yin, Liu, et al., 200330. m/0.25 mm/0.25 μm, Helium, 4. K/min; Tstart: 160. C; Tend: 280. C
CapillaryDB-52694.Olivero and Kannan, 199930. m/0.25 mm/0.25 μm, He, 4. K/min; Tstart: 160. C; Tend: 280. C

Normal alkane RI, non-polar column, custom temperature program

View large format table.

Column type Active phase I Reference Comment
CapillaryUltra-22668.Nakano, Fujimori, et al., 199225. m/0.20 mm/0.33 μm; Program: 50 0C (2 min) 30 0C/min -> 200 0C 8 0C/min -> 280 0C (10 min)

References

Yin, Liu, et al., 2003
Yin, C.; Liu, S.; Wang, X.; Chen, D.; Wang, L., An efficient and simple approach to predict Kovat's indexes of poluychlorinated naphthalenes in gas chromatography, J. Chinese Chem. Soc., 2003, 50, 875-879. [all data]

Olivero and Kannan, 1999
Olivero, L.; Kannan, K., Quantitative structure - retention relationships of polychlorinated naphthalenes in gas chromatography, J. Chromatogr., 1999, 849, 2, 621-627, https://doi.org/10.1016/S0021-9673(99)00402-1 . [all data]

Nakano, Fujimori, et al., 1992
Nakano, T.; Fujimori, K.; Takaishi, Y.; Okuno, T., GC/MS-SIM analysis of polychlorobenzenes, polychlorophenols and polychloronaphthalenes, Report of the Environmental Science Institute of Hyogo Prefecture, 1992, 24, 30-37. [all data]