exo-1H-Indene, 3a,4,7,7a-tetrahydro-4,7-ethano

Normal alkane RI, non-polar column, custom temperature program

View large format table.

Column type Active phase I Reference Comment
CapillaryOV-1011142.Zenkevich, 1998He; Column length: 25. m; Column diameter: 0.20 mm; Program: not specified

References

Zenkevich, 1998
Zenkevich, I.G., Application of Methods of Molecular Dynamics in Chromato-Spectral Identification of ISomeric Products of Organic reactions (in Russian), Zh. Org. Khim., 1998, 34, 10, 1463-1470. [all data]