α-Barbatene

Kovats' RI, polar column, isothermal

Data compiled by: NIST Mass Spectrometry Data Center, William E. Wallace, director

Column type PackedPackedPackedPackedPacked
Active phase Carbowax 20MCarbowax 20MCarbowax 20MCarbowax 20MCarbowax 20M
Column length (m) 7.37.37.37.37.3
Carrier gas
Substrate
Column diameter (mm)
Phase thickness (μm)
Temperature (C) 150.150.150.150.150.
I 1623.1628.1627.51623.1628.
ReferenceAndersen, Bissonette, et al., 1977Andersen, Bissonette, et al., 1977Andersen, Bissonette, et al., 1977Andersen, Bissonette, et al., 1977Andersen, Bissonette, et al., 1977
Comment MSDC-RI MSDC-RI MSDC-RI MSDC-RI MSDC-RI

References

Andersen, Bissonette, et al., 1977
Andersen, N.H.; Bissonette, P.; Liu, C.-B.; Shunk, B.; Ohta, Y.; Tseng, C.-L.W.; Moore, A.; Huneck, S., Sesquiterpenes of nine European liverworts from the genera, Anastrepta, Bazzania, Jungermannia, Lepidozia, and Scapania, Phytochemistry, 1977, 16, 11, 1731-1751, https://doi.org/10.1016/0031-9422(71)85081-1 . [all data]