β-Guajene

Van Den Dool and Kratz RI, non-polar column, temperature ramp

View large format table.

Column type Active phase I Reference Comment
CapillaryDB-51500.Isidorov, Zenkevich, et al., 2001He, 3. K/min; Column length: 30. m; Column diameter: 0.25 mm; Tstart: 50. C; Tend: 250. C

Normal alkane RI, non-polar column, custom temperature program

View large format table.

Column type Active phase I Reference Comment
CapillarySE-301482.Vinogradov, 2004Program: not specified
CapillaryDB-51500.Isidorov, Zenkevich, et al., 2001He; Column length: 30. m; Column diameter: 0.25 mm; Program: not specified
CapillaryMethyl Silicone1446.Zenkevich, 1996Program: not specified
CapillaryMethyl Silicone1482.Zenkevich, 1996Program: not specified

Normal alkane RI, polar column, custom temperature program

View large format table.

Column type Active phase I Reference Comment
CapillaryCarbowax 20M1658.Vinogradov, 2004Program: not specified

References

Isidorov, Zenkevich, et al., 2001
Isidorov, V.A.; Zenkevich, I.G.; Krajewska, U.; Dubis, E.N.; Jaroszynska, J.; Bal, K., Gas chromatographic analysis of essential oils with preliminary partition of components, Phytochem. Anal., 2001, 12, 2, 87-90, https://doi.org/10.1002/pca.564 . [all data]

Vinogradov, 2004
Vinogradov, B.A., Production, composition, properties and application of essential oils, 2004, retrieved from http://viness.narod.ru. [all data]

Zenkevich, 1996
Zenkevich, I.G., Analytical Parameters of Components of Essential Oils for their Chromatographic and Chromato-Mass Spectral Identification. Mono- and Sesquiterpenes, Rastitelnye Resursy (Plant resources), 1996, 34, 1-2, 48-58. [all data]