3-Hexene, 2,2,5-trimethyl

Normal alkane RI, non-polar column, custom temperature program

View large format table.

Column type Active phase I Reference Comment
CapillaryMethyl Silicone765.Zenkevich, 1995Program: not specified

References

Zenkevich, 1995
Zenkevich, I.G., Calculation of Gas-Chromatographic Retention Indices from Physico-Chemical Constants of Organic Compounds, Z. Anal. Chem., 1995, 50, 10, 1048-1056. [all data]