5-Aminoindane, TFA

Lee's RI, non-polar column, temperature ramp

Data compiled by: NIST Mass Spectrometry Data Center, William E. Wallace, director

Column type Capillary
Active phase SE-52
Column length (m) 12.
Carrier gas
Substrate
Column diameter (mm) 0.25
Phase thickness (μm)
Tstart (C) 50.
Tend (C) 270.
Heat rate (K/min) 2.
Initial hold (min)
Final hold (min)
I 262.67
ReferenceHasegawa, Usami, et al., 1990
Comment MSDC-RI

References

Hasegawa, Usami, et al., 1990
Hasegawa, K.; Usami, S.; Higashide, A., Analysis of amino polycyclic aromatic hydrocarbons and polycyclic aromatic nitrogen heterocycles, Nippon Kagaku Kaishi, 1990, 7, 777-788, https://doi.org/10.1246/nikkashi.1990.777 . [all data]