Benzene, 1-butyl-4-ethyl

Normal alkane RI, polar column, custom temperature program

Data compiled by: NIST Mass Spectrometry Data Center, William E. Wallace, director

Column type Capillary
Active phase Carbowax 20M
Column length (m)
Carrier gas
Substrate
Column diameter (mm)
Phase thickness (μm)
Program not specified
I 1440.
ReferenceIvanciuc, Ivanciuc, et al., 2001
Comment MSDC-RI

Kovats' RI, polar column, isothermal

Data compiled by: NIST Mass Spectrometry Data Center, William E. Wallace, director

Column type CapillaryCapillary
Active phase Carbowax 20MCarbowax 20M
Column length (m) 100.100.
Carrier gas N2
Substrate
Column diameter (mm) 0.230.2
Phase thickness (μm)
Temperature (C) 100.90.
I 1470.31439.5
ReferenceEngewald and Wennrich, 1976Döring, Estel, et al., 1974
Comment MSDC-RI MSDC-RI

References

Ivanciuc, Ivanciuc, et al., 2001
Ivanciuc, O.; Ivanciuc, T.; Klein, D.J.; Seitz, W.A.; Balaban, A.T., Quantitative structure-retention relationships for gas chromatographic retention indices of alkylbenzenes with molecular graph descriptors, SAR QSAR Environ. Res., 2001, 11, 5-6, 419-452, https://doi.org/10.1080/10629360108035362 . [all data]