Benzene, 1-methyl-4-pentyl

Normal alkane RI, polar column, isothermal

Data compiled by: NIST Mass Spectrometry Data Center, William E. Wallace, director

Column type CapillaryCapillaryCapillaryCapillaryCapillary
Active phase PEG-40MPEG-40MPEG-40MPEG-40MPEG-40M
Column length (m) 50.50.50.50.50.
Carrier gas
Substrate
Column diameter (mm)
Phase thickness (μm)
Temperature (C) 100.100.120.140.160.
I 1505.1506.1518.1531.1546.
ReferenceNesterov, Nesterova, et al., 2000Nesterov, Nesterova, et al., 2000Nesterov, Nesterova, et al., 2000Nesterov, Nesterova, et al., 2000Nesterov, Nesterova, et al., 2000
Comment MSDC-RI MSDC-RI MSDC-RI MSDC-RI MSDC-RI
Column type CapillaryCapillary
Active phase PEG-40MCarbowax 20M
Column length (m) 50.
Carrier gas
Substrate
Column diameter (mm)
Phase thickness (μm)
Temperature (C) 80.90.
I 1494.1470.
ReferenceNesterov, Nesterova, et al., 2000Sutter, Peterson, et al., 1997
Comment MSDC-RI MSDC-RI

References

Nesterov, Nesterova, et al., 2000
Nesterov, I.A.; Nesterova, T.N.; Pimerzin, A.A.; Tsvetkov, V.S., Thermodynamics of alkylbenzene sorption and evaporation. IV. Enthalpies of evaporation and thermodynamics chracteristics of sorption by stationary phases OV-101 and PEG-40M, Izvestia vysshikh uchebnykh zavedenii. Khimia i khimicheskaia tekhnologia (Chemistry and chemical technology), 2000, 43, 4, 39-45. [all data]

Sutter, Peterson, et al., 1997
Sutter, J.M.; Peterson, T.A.; Jurs, P.C., Prediction of gas chromatographic retention indices of alkylbenzenes, Anal. Chim. Acta., 1997, 342, 2-3, 113-122, https://doi.org/10.1016/S0003-2670(96)00578-8 . [all data]