Cyclohexene, 1-methyl-4-[1-methyl-1,2-bis-(methylthio)ethyl]

Normal alkane RI, non-polar column, temperature ramp

View large format table.

Column type Active phase I Reference Comment
CapillaryOV-1011656.Zenkevich and Kulikova, 1993He, 3. K/min; Column length: 54. m; Column diameter: 0.26 mm; Tstart: 50. C; Tend: 230. C

References

Zenkevich and Kulikova, 1993
Zenkevich, I.G.; Kulikova, S.N., GC-MS Analysis of Products of Reactions of Unsaturated Compounds with Dimethyl Disulfide for Determination of Position of Double Bonds C=C, Vestnik St. Petersburg University. Ser. phys-khim., 1993, 2, 59-69. [all data]