1-(1-Methoxycarbonylethyl)-2-methoxydiazen-1-oxide

Normal alkane RI, non-polar column, temperature ramp

View large format table.

Column type Active phase I Reference Comment
CapillaryOV-1011192.Zenkevich, Yandovskij, et al., 1991He, 3. K/min; Column length: 54. m; Column diameter: 0.26 mm; Tstart: 50. C; Tend: 220. C

References

Zenkevich, Yandovskij, et al., 1991
Zenkevich, I.G.; Yandovskij, V.N.; Ivanov, A.I., Chromato-Mass-Spectrometric Characterization of 1-Alkoxycarbonylalkyl-2-alkoxydiazen-1-oxides, Zh. Org. Khim., 1991, 27, 2, 239-246. [all data]