1-(1-Ethoxycarbonyl-1-methylethyl)-2-ethoxydiazen-1-oxide

Normal alkane RI, non-polar column, temperature ramp

Data compiled by: NIST Mass Spectrometry Data Center, William E. Wallace, director

Column type Capillary
Active phase OV-101
Column length (m) 54.
Carrier gas He
Substrate
Column diameter (mm) 0.26
Phase thickness (μm)
Tstart (C) 50.
Tend (C) 220.
Heat rate (K/min) 3.
Initial hold (min)
Final hold (min)
I 1332.
ReferenceZenkevich, Yandovskij, et al., 1991
Comment MSDC-RI

References

Zenkevich, Yandovskij, et al., 1991
Zenkevich, I.G.; Yandovskij, V.N.; Ivanov, A.I., Chromato-Mass-Spectrometric Characterization of 1-Alkoxycarbonylalkyl-2-alkoxydiazen-1-oxides, Zh. Org. Khim., 1991, 27, 2, 239-246. [all data]