Benzoyl-furoyl

Normal alkane RI, non-polar column, temperature ramp

View large format table.

Column type Active phase I Reference Comment
PackedOV-1011660.Zenkevich, Acevedo, et al., 1991Celite 545 (0.20-0.25 mm), 10. K/min; Column length: 1.2 m; Tstart: 100. C; Tend: 300. C

References

Zenkevich, Acevedo, et al., 1991
Zenkevich, I.G.; Acevedo, J.M.; Aguilera, I.R., Increments of Gas Chromatographic Retention Indices for Characterization of Organic Reactions, Vestn. St. Petersb. Univ. Ser. 4: Fiz. Khim, 1991, 2, 51-56. [all data]