Tetradecane, 3,7,11-trimethyl
- Formula: C17H36
- Molecular weight: 240.4677
- IUPAC Standard InChIKey: DVENTUCDIDVECP-UHFFFAOYSA-N
- Chemical structure:

Kovats' RI, non-polar column, isothermal

Column type | Active phase | Temperature (C) | I | Reference | Comment |
---|---|---|---|---|---|
Capillary | SE-30 | 100. | 1562. | Shlyakhov, Koreshkova, et al., 1975 | |
Capillary | SE-30 | 200. | 1567. | Shlyakhov, Koreshkova, et al., 1975 | |
Capillary | Apiezon L | 100. | 1551. | Shlyakhov, Koreshkova, et al., 1975 | |
Capillary | Apiezon L | 200. | 1553. | Shlyakhov, Koreshkova, et al., 1975 |

Van Den Dool and Kratz RI, non-polar column, temperature ramp

Column type | Active phase | I | Reference | Comment |
---|---|---|---|---|
Capillary | Cross-Linked Methylsilicone | 1570. | Khorasheh, Gray, et al., 1989 | 5. K/min; Tstart: 40. C; Tend: 300. C |

References

Shlyakhov, Koreshkova, et al., 1975
Shlyakhov, A.F.; Koreshkova, R.I.; Telkova, M.S.,
Gas Chromatography of Isoprenoid Alkanes,
J. Chromatogr., 1975, 104, 2, 337-349, https://doi.org/10.1016/S0021-9673(00)91857-0
. [all data]
Khorasheh, Gray, et al., 1989
Khorasheh, F.; Gray, M.R.; Selucky, M.L.,
Correlation for Kováts retention index of C9-C26 monoalkyl and polymethyl alkanes and alkenes,
J. Chromatogr., 1989, 481, 1-16, https://doi.org/10.1016/S0021-9673(01)96747-0
. [all data]