Cyclohexanone, oxime, acetate

Normal alkane RI, non-polar column, custom temperature program

Data compiled by: NIST Mass Spectrometry Data Center, William E. Wallace, director

Column type Capillary
Active phase OV-101
Column length (m) 50.
Carrier gas He
Substrate
Column diameter (mm) 0.24
Phase thickness (μm)
Program not specified
I 1148.
ReferenceZenkevich and Malamakhov, 1987
Comment MSDC-RI

References

Zenkevich and Malamakhov, 1987
Zenkevich, I.G.; Malamakhov, A.C., Evaluation of Molecular Weights of Organic Compounds based on Retention Parameters at Chromato-Spectral Analysys. Additional Criterion of Molecular Ions' Identification, Vestn. St. Petersb. Univ. Ser. 4: Fiz. Khim, 1987, 2, 101-106. [all data]