Formamidine, 1-butyl-3,3-dimethyl

Kovats' RI, non-polar column, isothermal

View large format table.

Column type Active phase Temperature (C) I Reference Comment
PackedSE-30240.985.Osek, Oszczapowicz, et al., 1986N2, Chromosorb W AW (60-80 mesh); Column length: 3. m
PackedSE-30240.985.Oszczapowicz, Osek, et al., 1984N2, Chromosorb W AW; Column length: 3. m

References

Osek, Oszczapowicz, et al., 1986
Osek, J.; Oszczapowicz, J.; Drzewinski, W., Prediction of Retention Indices of N1,N1-Dialkylformamidines on a Non-Polar Column, J. Chromatogr., 1986, 351, 177-182, https://doi.org/10.1016/S0021-9673(01)83486-5 . [all data]

Oszczapowicz, Osek, et al., 1984
Oszczapowicz, J.; Osek, J.; Dolecka, E., Retention indices of dimethylformamidines, dimethylacetamidines and tetramethylguanidines on a non-polar column, J. Chromatogr., 1984, 315, 95-100, https://doi.org/10.1016/S0021-9673(01)90727-7 . [all data]