5-Cholesten-3-β,27-diol, TMS

Normal alkane RI, non-polar column, custom temperature program

Data compiled by: NIST Mass Spectrometry Data Center, William E. Wallace, director

Column type CapillaryCapillary
Active phase Ultra-1Ultra-1
Column length (m) 25.25.
Carrier gas H2
Substrate
Column diameter (mm) 0.320.32
Phase thickness (μm) 0.170.17
Program 50 0C (3 min) -> 185 0C 5 K/min -> 280 0C50C (3min) => (rapidly) => 185C => 5C/min => 280C
I 3450.3455.
ReferenceAxelson, Ellis, et al., 2000Axelson and Larsson, 1996
Comment MSDC-RI MSDC-RI

Kovats' RI, non-polar column, isothermal

Data compiled by: NIST Mass Spectrometry Data Center, William E. Wallace, director

Column type Packed
Active phase OV-1
Column length (m) 2.
Carrier gas N2
Substrate
Column diameter (mm)
Phase thickness (μm)
Temperature (C) 265.
I 3450.
ReferenceGaskell, Smith, et al., 1975
Comment MSDC-RI

References

Axelson, Ellis, et al., 2000
Axelson, M.; Ellis, E.; Mörk, B.; Garmark, K.; Abrahamsson, A.; Björkhem, I.; Ericzon, B.-G.; Einarsson, C., Bile acid synthesis in cultured human hepatocytes: support for an alternative biosynthetic pathway to cholic acid, Hepatology, 2000, 31, 6, 1305-1312, https://doi.org/10.1053/jhep.2000.7877 . [all data]

Axelson and Larsson, 1996
Axelson, M.; Larsson, O., 27-Hydroxylated low density lipoprotein (LDL) cholesterol can be converted to 7α,27-Dihydroxy-4-cholesten-3-one (cytosterone) before suppressing cholesterol production in normal human fibroblasts. Evidence that an altered metabolism of LDL cholesterol can underlie a defective feedback control in malignant cells, J. Biol. Chem., 1996, 271, 22, 12724-12736. [all data]