25-Hydroxy-4-cholesten-3-one, enol-bis-TMS

Kovats' RI, non-polar column, isothermal

View large format table.

Column type Active phase Temperature (C) I Reference Comment
PackedOV-1265.3470.Gaskell, Smith, et al., 1975N2; Column length: 2. m

References

Gaskell, Smith, et al., 1975
Gaskell, S.J.; Smith, A.G.; Brooks, C.J.W., Gas chromatography mass spectrometry of trimethylsilyl ethers of sidechain hydroxylated Δ4-3-ketosteroids. Long range trimethylsilyl group migration under electron impact, Biomed. Mass Spectrom., 1975, 2, 3, 148-155, https://doi.org/10.1002/bms.1200020309 . [all data]