2,3,6-Trimethyl-1,4-diacetylglucoside (B)

Kovats' RI, non-polar column, isothermal

View large format table.

Column type Active phase Temperature (C) I Reference Comment
CapillaryOV-1170.1566.Zhu, 1985N2; Column length: 15. m; Column diameter: 0.32 mm

Van Den Dool and Kratz RI, non-polar column, temperature ramp

View large format table.

Column type Active phase I Reference Comment
CapillaryOV-11553.Zhu, 1985N2, 2. K/min; Column length: 15. m; Column diameter: 0.32 mm; Tstart: 150. C; Tend: 180. C
CapillaryOV-11571.Zhu, 1985N2, 2. K/min; Column length: 15. m; Column diameter: 0.32 mm; Tstart: 150. C; Tend: 180. C

References

Zhu, 1985
Zhu, A., Calculation of retention indices in temperature-programmed capillary gas chromatography, J. Chromatogr., 1985, 331, 229-235, https://doi.org/10.1016/0021-9673(85)80028-5 . [all data]