2,3,4,6-Tetramethyl-1-acetylglucoside (B)

Kovats' RI, non-polar column, isothermal

Data compiled by: NIST Mass Spectrometry Data Center, William E. Wallace, director

Column type Capillary
Active phase OV-1
Column length (m) 15.
Carrier gas N2
Substrate
Column diameter (mm) 0.32
Phase thickness (μm)
Temperature (C) 170.
I 1450.
ReferenceZhu, 1985
Comment MSDC-RI

References

Zhu, 1985
Zhu, A., Calculation of retention indices in temperature-programmed capillary gas chromatography, J. Chromatogr., 1985, 331, 229-235, https://doi.org/10.1016/0021-9673(85)80028-5 . [all data]