5,5-Diethyl-2-(1-methylethyl)-4-isobutanoyl-1,3,4-oxadiazoline

Normal alkane RI, non-polar column, temperature ramp

Data compiled by: NIST Mass Spectrometry Data Center, William E. Wallace, director

Column type Packed
Active phase SE-30
Column length (m) 1.8
Carrier gas He
Substrate Chromosorb W AW DMCS (80-100 mesh)
Column diameter (mm)
Phase thickness (μm)
Tstart (C) 70.
Tend (C)
Heat rate (K/min) 5.
Initial hold (min)
Final hold (min)
I 1410.
ReferenceZenkevich and Yandovskij, 1984
Comment MSDC-RI

References

Zenkevich and Yandovskij, 1984
Zenkevich, I.G.; Yandovskij, V.N., Chromato-Mass-Spectrometric Characterization of Substituted 4-Acyl-1,3,4-oxadiazolines, Khim. Geterotsikl. Soedin., 1984, 5, 623-631. [all data]