2,5-Diethyl-5-methyl-4-propionyl-1,3,4-oxadiazoline

Normal alkane RI, non-polar column, temperature ramp

View large format table.

Column type Active phase I Reference Comment
PackedSE-301280.Zenkevich and Yandovskij, 1984He, Chromosorb W AW DMCS (80-100 mesh), 5. K/min; Column length: 1.8 m; Tstart: 70. C

References

Zenkevich and Yandovskij, 1984
Zenkevich, I.G.; Yandovskij, V.N., Chromato-Mass-Spectrometric Characterization of Substituted 4-Acyl-1,3,4-oxadiazolines, Khim. Geterotsikl. Soedin., 1984, 5, 623-631. [all data]