Acetic acid, dibromo, 1,1-dimethylpropyl ester

Van Den Dool and Kratz RI, non-polar column, temperature ramp

View large format table.

Column type Active phase I Reference Comment
CapillarySE-301221.Korhonen, 19846. K/min; Column length: 25. m; Column diameter: 0.3 mm; Tstart: 50. C

Van Den Dool and Kratz RI, polar column, temperature ramp

View large format table.

Column type Active phase I Reference Comment
CapillaryOV-3511680.Korhonen, 19846. K/min; Column length: 25. m; Column diameter: 0.32 mm; Tstart: 50. C

References

Korhonen, 1984
Korhonen, I.O.O., Gas-Liquid Chromatographic Analyses. XXV. Branched-Chain C3-C5 Alkyl Esters of Halogenated Acetic Acids, J. Chromatogr., 1984, 288, 51-69, https://doi.org/10.1016/S0021-9673(01)93681-7 . [all data]