2,3,5-Tetralinetriol, DTBS, 5-TMS

Normal alkane RI, non-polar column, custom temperature program

Data compiled by: NIST Mass Spectrometry Data Center, William E. Wallace, director

Column type Capillary
Active phase OV-1
Column length (m) 25.
Carrier gas He
Substrate
Column diameter (mm) 0.25
Phase thickness (μm)
Program 80 0C (2 min) 30 0C/min -> 140 0C (2 min) 1.5 0C/min -> 200 0C; or: 80 0C (2 min) 30 0C/min -> 200 0C 2 0C/min -> 260 0C
I 2195.
ReferenceBrooks, Cole, et al., 1984
Comment MSDC-RI

References

Brooks, Cole, et al., 1984
Brooks, C.J.W.; Cole, W.J.; Barrett, G.M., Studies of cyclic Di-tert.-butylsilylene derivatives of diols and hydroxy acids by gas chromatography-mass spectrometry, J. Chromatogr., 1984, 315, 119-133, https://doi.org/10.1016/S0021-9673(01)90730-7 . [all data]