Propanoic acid, 2-chloro, 3-butenyl ester

Kovats' RI, non-polar column, isothermal

View large format table.

Column type Active phase Temperature (C) I Reference Comment
CapillarySE-30100.1007.Haken and Korhonen, 1985Column length: 25. m; Column diameter: 0.33 mm
CapillarySE-30120.998.Haken and Korhonen, 1985Column length: 25. m; Column diameter: 0.33 mm
CapillarySE-30140.1020.Haken and Korhonen, 1985Column length: 25. m; Column diameter: 0.33 mm
CapillarySE-30160.1030.Haken and Korhonen, 1985Column length: 25. m; Column diameter: 0.33 mm
CapillarySE-3080.1024.Haken and Korhonen, 1985Column length: 25. m; Column diameter: 0.33 mm

Kovats' RI, polar column, isothermal

View large format table.

Column type Active phase Temperature (C) I Reference Comment
CapillaryOV-351100.1454.Haken and Korhonen, 1985N2; Column length: 25. m; Column diameter: 0.32 mm
CapillaryOV-351120.1453.Haken and Korhonen, 1985N2; Column length: 25. m; Column diameter: 0.32 mm
CapillaryOV-35180.1458.Haken and Korhonen, 1985N2; Column length: 25. m; Column diameter: 0.32 mm

References

Haken and Korhonen, 1985
Haken, J.K.; Korhonen, I.O.O., Gas-liquid chromatography of homologous esters. XXIX. Propanoyl and monochlorpropanoyl esters of lower saturated branched-chain and unsaturated alcohols, J. Chromatogr., 1985, 324, 343-353, https://doi.org/10.1016/S0021-9673(01)81333-9 . [all data]