Propanoic acid, 1,2-dimethylpropyl ester

Kovats' RI, polar column, isothermal

Data compiled by: NIST Mass Spectrometry Data Center, William E. Wallace, director

Column type CapillaryCapillaryCapillaryPacked
Active phase OV-351OV-351OV-351Carbowax 20M
Column length (m) 25.25.25.2.
Carrier gas N2N2N2
Substrate    Chromosorb W
Column diameter (mm) 0.320.320.32
Phase thickness (μm)
Temperature (C) 100.60.80.100.
I 1130.1125.1121.1130.
ReferenceHaken and Korhonen, 1985Haken and Korhonen, 1985Haken and Korhonen, 1985Zarazir, Chovin, et al., 1970
Comment MSDC-RI MSDC-RI MSDC-RI MSDC-RI

References

Haken and Korhonen, 1985
Haken, J.K.; Korhonen, I.O.O., Gas-liquid chromatography of homologous esters. XXIX. Propanoyl and monochlorpropanoyl esters of lower saturated branched-chain and unsaturated alcohols, J. Chromatogr., 1985, 324, 343-353, https://doi.org/10.1016/S0021-9673(01)81333-9 . [all data]

Zarazir, Chovin, et al., 1970
Zarazir, D.; Chovin, P.; Guiochon, G., Identification of hydroxylic compounds and their derivatives by gas chromatography, Chromatographia, 1970, 3, 4, 180-195, https://doi.org/10.1007/BF02269018 . [all data]