Silane, triethyl pentyl

Kovats' RI, non-polar column, isothermal

View large format table.

Column type Active phase Temperature (C) I Reference Comment
CapillaryApiezon L160.1164.Peetre and Smith, 1974

References

Peetre and Smith, 1974
Peetre, I.-B.; Smith, B.E.F., Gas chromatographic investigation of organometallic compounds and their carbon analogues. IV. determination, calculation and correlation of Kováts retention indices for tetraalkylsilanes, J. Chromatogr., 1974, 90, 1, 41-55, https://doi.org/10.1016/S0021-9673(01)94772-7 . [all data]