2-chloropropyl dichloroacetate

Kovats' RI, non-polar column, isothermal

View large format table.

Column type Active phase Temperature (C) I Reference Comment
CapillarySE-30100.1117.Haken and Korhonen, 1986N2; Column length: 25. m; Column diameter: 0.33 mm
CapillarySE-30120.1089.Haken and Korhonen, 1986N2; Column length: 25. m; Column diameter: 0.33 mm
CapillarySE-30140.1133.Haken and Korhonen, 1986N2; Column length: 25. m; Column diameter: 0.33 mm
CapillarySE-30160.1132.Haken and Korhonen, 1986N2; Column length: 25. m; Column diameter: 0.33 mm
CapillarySE-3080.1127.Haken and Korhonen, 1986N2; Column length: 25. m; Column diameter: 0.33 mm

Kovats' RI, polar column, isothermal

View large format table.

Column type Active phase Temperature (C) I Reference Comment
CapillaryOV-351120.1786.Haken and Korhonen, 1986N2; Column length: 25. m; Column diameter: 0.33 mm
CapillaryOV-351140.1812.Haken and Korhonen, 1986N2; Column length: 25. m; Column diameter: 0.33 mm
CapillaryOV-351160.1810.Haken and Korhonen, 1986N2; Column length: 25. m; Column diameter: 0.33 mm
CapillaryOV-351180.1819.Haken and Korhonen, 1986N2; Column length: 25. m; Column diameter: 0.33 mm
CapillaryOV-351200.1821.Haken and Korhonen, 1986N2; Column length: 25. m; Column diameter: 0.33 mm

References

Haken and Korhonen, 1986
Haken, J.R.; Korhonen, I.O.O., Gas chromatography of homologous esters. XXXIII. Capillary chromatography of monochlorinated C1-C8 n-alkyl acetates, chloracetates, dichloroacetates and trichloroacetates, J. Chromatogr., 1986, 357, 253-271, https://doi.org/10.1016/S0021-9673(01)95828-5 . [all data]