4-chloroheptyl trichloroacetate

Kovats' RI, non-polar column, isothermal

View large format table.

Column type Active phase Temperature (C) I Reference Comment
CapillarySE-30140.1622.Haken and Korhonen, 1986N2; Column length: 25. m; Column diameter: 0.33 mm
CapillarySE-30160.1632.Haken and Korhonen, 1986N2; Column length: 25. m; Column diameter: 0.33 mm
CapillarySE-30180.1642.Haken and Korhonen, 1986N2; Column length: 25. m; Column diameter: 0.33 mm
CapillarySE-30200.1652.Haken and Korhonen, 1986N2; Column length: 25. m; Column diameter: 0.33 mm

Kovats' RI, polar column, isothermal

View large format table.

Column type Active phase Temperature (C) I Reference Comment
CapillaryOV-351160.2191.Haken and Korhonen, 1986N2; Column length: 25. m; Column diameter: 0.32 mm
CapillaryOV-351180.2209.Haken and Korhonen, 1986N2; Column length: 25. m; Column diameter: 0.32 mm
CapillaryOV-351200.2223.Haken and Korhonen, 1986N2; Column length: 25. m; Column diameter: 0.32 mm

References

Haken and Korhonen, 1986
Haken, J.R.; Korhonen, I.O.O., Gas chromatography of homologous esters. XXXIII. Capillary chromatography of monochlorinated C1-C8 n-alkyl acetates, chloracetates, dichloroacetates and trichloroacetates, J. Chromatogr., 1986, 357, 253-271, https://doi.org/10.1016/S0021-9673(01)95828-5 . [all data]