24-Ethylcoprostanol acetate

Kovats' RI, non-polar column, isothermal

View large format table.

Column type Active phase Temperature (C) I Reference Comment
CapillaryOV-1260.3303.Itoh, Tani, et al., 1982N2; Column length: 30. m; Column diameter: 0.30 mm

References

Itoh, Tani, et al., 1982
Itoh, T.; Tani, H.; Fukushima, K.; Tamura, T.; Matsumoto, T., Structure-Retention Relationship of Sterols and Triterpene Alcohols in Gas Chromatography on a Glass Capillary Column, J. Chromatogr., 1982, 234, 1, 65-76, https://doi.org/10.1016/S0021-9673(00)81781-1 . [all data]