N-Methylangustifoline

Normal alkane RI, non-polar column, temperature ramp

Data compiled by: NIST Mass Spectrometry Data Center, William E. Wallace, director

Column type CapillaryCapillary
Active phase DB-1SE-30
Column length (m) 30.15.
Carrier gas HeHe
Substrate
Column diameter (mm) 0.320.26
Phase thickness (μm)
Tstart (C) 150.150.
Tend (C) 300.270.
Heat rate (K/min) 6.6.
Initial hold (min)
Final hold (min)
I 2073.2050.
ReferenceGreinwald, Henrichs, et al., 1995Wink, Witte, et al., 1981
Comment MSDC-RI MSDC-RI

References

Greinwald, Henrichs, et al., 1995
Greinwald, R.; Henrichs, C.; Veen, G.; Ross, J.H.; Witte, L.; Czygan, F.-C., A survey of alkaloids in templetonia biloba (Benth.) Polhill (Fabaceae: Brongniartieae), Biochem. Syst. Ecol., 1995, 23, 6, 649-654, https://doi.org/10.1016/0305-1978(95)00035-6 . [all data]

Wink, Witte, et al., 1981
Wink, M.; Witte, L.; Hartmann. T., Quinolizidine Alkaloid Composition of Plants and of Photomixotrophis Cell Suspension Cultures of Sarothamnus scoparius and Orobanche rapum-genistae, Planta Medica, 1981, 43, 12, 342-352, https://doi.org/10.1055/s-2007-971522 . [all data]