4,13-Dihydroxylupanine

Normal alkane RI, non-polar column, temperature ramp

View large format table.

Column type Active phase I Reference Comment
CapillarySE-302510.Wink, Witte, et al., 1981He, 6. K/min; Column length: 15. m; Column diameter: 0.26 mm; Tstart: 150. C; Tend: 270. C

References

Wink, Witte, et al., 1981
Wink, M.; Witte, L.; Hartmann. T., Quinolizidine Alkaloid Composition of Plants and of Photomixotrophis Cell Suspension Cultures of Sarothamnus scoparius and Orobanche rapum-genistae, Planta Medica, 1981, 43, 12, 342-352, https://doi.org/10.1055/s-2007-971522 . [all data]