13-Tigloyloxylupanine

Normal alkane RI, non-polar column, custom temperature program

Data compiled by: NIST Mass Spectrometry Data Center, William E. Wallace, director

Column type Capillary
Active phase DB-1
Column length (m) 30.
Carrier gas He
Substrate
Column diameter (mm) 0.32
Phase thickness (μm)
Program 150C (2min) => 10C/min => 250C => 20C/min => 300C (5min)
I 2750.
ReferenceGreinwald, van Rensen, et al., 1995
Comment MSDC-RI

References

Greinwald, van Rensen, et al., 1995
Greinwald, R.; van Rensen, I.; Veit, M.; Canto, P.; Witte, L., A chemical dichotomy in quinolizidine alkaloid accumulation within the section Spartioides of the genus Genista (Fabaceae: Genisteae), Biochem. Syst. Ecol., 1995, 23, 1, 89-97, https://doi.org/10.1016/0305-1978(95)93662-M . [all data]